Reaction Details
TargetPeroxisome proliferator-activated receptor delta
LigandBDBM28700
Substrate/Competitorn/a
Meas. Tech.ChEMBL_468714 (CHEMBL929850)
EC50>100000±n/a nM
Citation Asaki, TAoki, THamamoto, TSugiyama, YOhmachi, SKuwabara, KMurakami, KTodo, M Structure-activity studies on 1,3-dioxane-2-carboxylic acid derivatives, a novel class of subtype-selective peroxisome proliferator-activated receptor alpha (PPARalpha) agonists. Bioorg Med Chem16:981-94 (2008) 
 
Peroxisome proliferator-activated receptor delta
Name:Peroxisome proliferator-activated receptor delta
Type:Enzyme
Mol. Mass.:49910.45
Organism:Homo sapiens (Human)
Description:Q03181
Residue:441
BDBM28700
NameBDBM28700
Synonyms:2-(4-(4-Chlorobenzoyl)phenoxy)-2-methylpropionic acid CHEMBL981 FIBRICOR LF 153 procetofenic acid
TypeSmall organic molecule
Emp. Form.C17H15ClO4
Mol. Mass.318.752
SMILESCC(C)(Oc1ccc(cc1)C(=O)c1ccc(Cl)cc1)C(O)=O