Reaction Details
TargetMelanocortin receptor 3
LigandBDBM50374115
Substrate/Competitorn/a
Meas. Tech.ChEMBL_468952 (CHEMBL951291)
EC50 23300±n/a nM
Citation Joseph, CGWilson, KRWood, MSSorenson, NBPhan, DVXiang, ZWitek, RMHaskell-Luevano, C The 1,4-benzodiazepine-2,5-dione small molecule template results in melanocortin receptor agonists with nanomolar potencies. J Med Chem51:1423-31 (2008) 
 
Melanocortin receptor 3
Name:Melanocortin receptor 3
Type:PROTEIN
Mol. Mass.:35808.24
Organism:Mus musculus
Description:ChEMBL_1498848
Residue:323
BDBM50374115
NameBDBM50374115
Synonyms:CHEMBL270691
TypeSmall organic molecule
Emp. Form.C27H21ClN2O2
Mol. Mass.440.921
SMILESClc1ccc2c(c1)N(Cc1ccc3ccccc3c1)C(=O)C(Cc1ccccc1)NC2=O