Reaction Details
TargetMelanocortin receptor 3
LigandBDBM50374120
Substrate/Competitorn/a
Meas. Tech.ChEMBL_468952 (CHEMBL951291)
EC50>100000±n/a nM
Citation Joseph, CGWilson, KRWood, MSSorenson, NBPhan, DVXiang, ZWitek, RMHaskell-Luevano, C The 1,4-benzodiazepine-2,5-dione small molecule template results in melanocortin receptor agonists with nanomolar potencies. J Med Chem51:1423-31 (2008) 
 
Melanocortin receptor 3
Name:Melanocortin receptor 3
Type:PROTEIN
Mol. Mass.:35808.24
Organism:Mus musculus
Description:ChEMBL_1498848
Residue:323
BDBM50374120
NameBDBM50374120
Synonyms:CHEMBL272843
TypeSmall organic molecule
Emp. Form.C25H21N3O2
Mol. Mass.395.4531
SMILESO=C1NC(Cc2c[nH]c3ccccc23)C(=O)N(Cc2ccccc2)c2ccccc12