Reaction Details
TargetMelanocortin receptor 3
LigandBDBM50374121
Substrate/Competitorn/a
Meas. Tech.ChEMBL_468952 (CHEMBL951291)
EC50>100000±n/a nM
Citation Joseph, CGWilson, KRWood, MSSorenson, NBPhan, DVXiang, ZWitek, RMHaskell-Luevano, C The 1,4-benzodiazepine-2,5-dione small molecule template results in melanocortin receptor agonists with nanomolar potencies. J Med Chem51:1423-31 (2008) 
 
Melanocortin receptor 3
Name:Melanocortin receptor 3
Type:PROTEIN
Mol. Mass.:35808.24
Organism:Mus musculus
Description:ChEMBL_1498848
Residue:323
BDBM50374121
NameBDBM50374121
Synonyms:CHEMBL272662
TypeSmall organic molecule
Emp. Form.C20H23N5O2
Mol. Mass.365.4289
SMILES[#7]\[#6](-[#7])=[#7]\[#6]-[#6]-[#6]-[#6]-1-[#7]-[#6](=O)-c2ccccc2-[#7](-[#6]-c2ccccc2)-[#6]-1=O