Reaction Details
TargetMelanocyte-stimulating hormone receptor
LigandBDBM50374125
Substrate/Competitorn/a
Meas. Tech.ChEMBL_468951 (CHEMBL951290)
EC50 3400±n/a nM
Citation Joseph, CGWilson, KRWood, MSSorenson, NBPhan, DVXiang, ZWitek, RMHaskell-Luevano, C The 1,4-benzodiazepine-2,5-dione small molecule template results in melanocortin receptor agonists with nanomolar potencies. J Med Chem51:1423-31 (2008) 
 
Melanocyte-stimulating hormone receptor
Name:Melanocyte-stimulating hormone receptor
Type:PROTEIN
Mol. Mass.:35238.60
Organism:Mus musculus
Description:ChEMBL_1498846
Residue:315
BDBM50374125
NameBDBM50374125
Synonyms:CHEMBL409222
TypeSmall organic molecule
Emp. Form.C24H24ClN3O2
Mol. Mass.421.919
SMILESNCCCCC1NC(=O)c2ccc(Cl)cc2N(Cc2ccc3ccccc3c2)C1=O