Reaction Details
TargetMelanocortin receptor 3
LigandBDBM50374123
Substrate/Competitorn/a
Meas. Tech.ChEMBL_468952 (CHEMBL951291)
EC50 4160±n/a nM
Citation Joseph, CGWilson, KRWood, MSSorenson, NBPhan, DVXiang, ZWitek, RMHaskell-Luevano, C The 1,4-benzodiazepine-2,5-dione small molecule template results in melanocortin receptor agonists with nanomolar potencies. J Med Chem51:1423-31 (2008) 
 
Melanocortin receptor 3
Name:Melanocortin receptor 3
Type:PROTEIN
Mol. Mass.:35808.24
Organism:Mus musculus
Description:ChEMBL_1498848
Residue:323
BDBM50374123
NameBDBM50374123
Synonyms:CHEMBL273044
TypeSmall organic molecule
Emp. Form.C29H24N2O2
Mol. Mass.432.5131
SMILESO=C1NC(Cc2ccccc2)C(=O)N(Cc2ccccc2-c2ccccc2)c2ccccc12