Reaction Details
TargetMelanocortin receptor 5
LigandBDBM50374122
Substrate/Competitorn/a
Meas. Tech.ChEMBL_468954 (CHEMBL951293)
EC50 3267±n/a nM
Citation Joseph, CGWilson, KRWood, MSSorenson, NBPhan, DVXiang, ZWitek, RMHaskell-Luevano, C The 1,4-benzodiazepine-2,5-dione small molecule template results in melanocortin receptor agonists with nanomolar potencies. J Med Chem51:1423-31 (2008) 
 
Melanocortin receptor 5
Name:Melanocortin receptor 5
Type:Enzyme
Mol. Mass.:36966.58
Organism:Mus musculus (Mouse)
Description:P41149
Residue:325
BDBM50374122
NameBDBM50374122
Synonyms:CHEMBL269837
TypeSmall organic molecule
Emp. Form.C19H20N2O2
Mol. Mass.308.3743
SMILESCCCN1c2ccccc2C(=O)NC(Cc2ccccc2)C1=O