Reaction Details
TargetMelanocortin receptor 5
LigandBDBM50374117
Substrate/Competitorn/a
Meas. Tech.ChEMBL_468954 (CHEMBL951293)
EC50>100000±n/a nM
Citation Joseph, CGWilson, KRWood, MSSorenson, NBPhan, DVXiang, ZWitek, RMHaskell-Luevano, C The 1,4-benzodiazepine-2,5-dione small molecule template results in melanocortin receptor agonists with nanomolar potencies. J Med Chem51:1423-31 (2008) 
 
Melanocortin receptor 5
Name:Melanocortin receptor 5
Type:Enzyme
Mol. Mass.:36966.58
Organism:Mus musculus (Mouse)
Description:P41149
Residue:325
BDBM50374117
NameBDBM50374117
Synonyms:CHEMBL406651
TypeSmall organic molecule
Emp. Form.C23H20N2O2
Mol. Mass.356.4171
SMILESO=C1NC(Cc2ccccc2)C(=O)N(Cc2ccccc2)c2ccccc12