Reaction Details
TargetCyclin-dependent kinase 1
LigandBDBM7720
Substrate/Competitorn/a
Meas. Tech.ChEMBL_468974 (CHEMBL952119)
IC50 2.8±n/a nM
Citation Kolb, PHuang, DDey, FCaflisch, A Discovery of kinase inhibitors by high-throughput docking and scoring based on a transferable linear interaction energy model. J Med Chem51:1179-88 (2008) 
 
Cyclin-dependent kinase 1
Name:Cyclin-dependent kinase 1
Type:Enzyme Subunit
Mol. Mass.:34101.08
Organism:Homo sapiens (Human)
Description:P06493
Residue:297
BDBM7720
NameBDBM7720
Synonyms:(3Z)-2-oxo-3-[2-(4-sulfamoylphenyl)hydrazin-1-ylidene]-2,3-dihydro-1H-indole-5-carboxamide Oxindole-Based Inhibitor 56
TypeSmall organic molecule
Emp. Form.C15H13N5O4S
Mol. Mass.359.36
SMILESNC(=O)c1ccc2NC(=O)C(=NNc3ccc(cc3)S(N)(=O)=O)c2c1