Reaction Details
TargetTyrosine-protein kinase Lck
LigandBDBM50120093
Substrate/Competitorn/a
Meas. Tech.ChEMBL_468975 (CHEMBL952120)
IC50 3±n/a nM
Citation Kolb, PHuang, DDey, FCaflisch, A Discovery of kinase inhibitors by high-throughput docking and scoring based on a transferable linear interaction energy model. J Med Chem51:1179-88 (2008) 
 
Tyrosine-protein kinase Lck
Name:Tyrosine-protein kinase Lck
Type:n/a
Mol. Mass.:57987.83
Organism:Homo sapiens (Human)
Description:P06239
Residue:509
BDBM50120093
NameBDBM50120093
Synonyms:(2-Chloro-6-methyl-phenyl)-(8-piperazin-1-yl-imidazo[1,5-a]quinoxalin-4-yl)-amine N-(2-chloro-6-methylphenyl)-8-(piperazin-1-yl)imidazo[1,5-a]quinoxalin-4-amine
TypeSmall organic molecule
Emp. Form.C21H21ClN6
Mol. Mass.392.885
SMILESCc1cccc(Cl)c1Nc1nc2ccc(cc2n2cncc12)N1CCNCC1