Reaction Details
TargetMitogen-activated protein kinase 14
LigandBDBM17060
Substrate/Competitorn/a
Meas. Tech.ChEMBL_468977 (CHEMBL952122)
IC50 0.200000±n/a nM
Citation Kolb, PHuang, DDey, FCaflisch, A Discovery of kinase inhibitors by high-throughput docking and scoring based on a transferable linear interaction energy model. J Med Chem51:1179-88 (2008) 
 
Mitogen-activated protein kinase 14
Name:Mitogen-activated protein kinase 14
Type:Serine/threonine-protein kinase
Mol. Mass.:41286.76
Organism:Homo sapiens (Human)
Description:Q16539
Residue:360
BDBM17060
NameBDBM17060
Synonyms:1-(2,6-dichlorophenyl)-5-(2,4-difluorophenyl)-7-(piperidin-4-yl)-1,2,3,4-tetrahydroquinazolin-2-one Dihydro-quinazolinone analog, 9
TypeSmall organic molecule
Emp. Form.C25H21Cl2F2N3O
Mol. Mass.488.357
SMILESFc1ccc(c(F)c1)-c1cc(cc2N(C(=O)NCc12)c1c(Cl)cccc1Cl)C1CCNCC1