Reaction Details
TargetTyrosine-protein kinase Lck
LigandBDBM50112911
Substrate/Competitorn/a
Meas. Tech.ChEMBL_468975 (CHEMBL952120)
IC50 2±n/a nM
Citation Kolb, PHuang, DDey, FCaflisch, A Discovery of kinase inhibitors by high-throughput docking and scoring based on a transferable linear interaction energy model. J Med Chem51:1179-88 (2008) 
 
Tyrosine-protein kinase Lck
Name:Tyrosine-protein kinase Lck
Type:n/a
Mol. Mass.:57987.83
Organism:Homo sapiens (Human)
Description:P06239
Residue:509
BDBM50112911
NameBDBM50112911
Synonyms:(2-Chloro-6-methyl-phenyl)-(6,7-dimethoxy-imidazo[1,5-a]quinoxalin-4-yl)-amine N-(2-chloro-6-methylphenyl)-6,7-dimethoxyimidazo[1,5-a]quinoxalin-4-amine
TypeSmall organic molecule
Emp. Form.C19H17ClN4O2
Mol. Mass.368.817
SMILESCOc1ccc2c(nc(Nc3c(C)cccc3Cl)c3cncn23)c1OC