Reaction Details
TargetCyclin-dependent kinase 2
LigandBDBM7741
Substrate/Competitorn/a
Meas. Tech.ChEMBL_468964 (CHEMBL952109)
IC50 2.2±n/a nM
Citation Kolb, PHuang, DDey, FCaflisch, A Discovery of kinase inhibitors by high-throughput docking and scoring based on a transferable linear interaction energy model. J Med Chem51:1179-88 (2008) 
 
Cyclin-dependent kinase 2
Name:Cyclin-dependent kinase 2
Type:Enzyme Subunit
Mol. Mass.:33938.17
Organism:Homo sapiens (Human)
Description:P24941
Residue:298
BDBM7741
NameBDBM7741
Synonyms:4-[N -(1-Chloro-7-oxo-6,7-dihydro-3H-pyrrolo[3,2-e]indazol-8-ylidene)-hydrazino]benzenesulfonamide Oxindole-Based Inhibitor 77
TypeSmall organic molecule
Emp. Form.C15H11ClN6O3S
Mol. Mass.390.804
SMILESNS(=O)(=O)c1ccc(cc1)N=Nc1c2c(ccc3[nH][nH]c(Cl)c23)[nH]c1=O