Reaction Details
TargetBeta-secretase 1
LigandBDBM50374221
Substrate/Competitorn/a
Meas. Tech.ChEMBL_469154 (CHEMBL929073)
IC50 71±n/a nM
Citation Iserloh, UPan, JStamford, AWKennedy, MEZhang, QZhang, LParker, EMMcHugh, NAFavreau, LStrickland, CVoigt, J Discovery of an orally efficaceous 4-phenoxypyrrolidine-based BACE-1 inhibitor. Bioorg Med Chem Lett18:418-22 (2008) 
 
Beta-secretase 1
Name:Beta-secretase 1
Type:Protein
Mol. Mass.:55755.10
Organism:Homo sapiens (Human)
Description:P56817
Residue:501
BDBM50374221
NameBDBM50374221
Synonyms:CHEMBL255540
TypeSmall organic molecule
Emp. Form.C32H43F2N3O4
Mol. Mass.571.6983
SMILESCCCC(CCC)N1C[C@H](CC1=O)C(=O)N[C@@H](Cc1cc(F)cc(F)c1)[C@H](O)[C@H]1C[C@H](CN1)OCc1ccccc1