Reaction Details
TargetCarbonic anhydrase 1
LigandBDBM50097287
Substrate/Competitorn/a
Meas. Tech.ChEMBL_469182 (CHEMBL932207)
Ki 487±n/a nM
Citation Rami, MWinum, JYInnocenti, AMontero, JLScozzafava, ASupuran, CT Carbonic anhydrase inhibitors: copper(II) complexes of polyamino-polycarboxylamido aromatic/heterocyclic sulfonamides are very potent inhibitors of the tumor-associated isoforms IX and XII. Bioorg Med Chem Lett18:836-41 (2008) 
 
Carbonic anhydrase 1
Name:Carbonic anhydrase 1
Type:Enzyme
Mol. Mass.:28873.37
Organism:Homo sapiens (Human)
Description:P00915
Residue:261
BDBM50097287
NameBDBM50097287
Synonyms:CHEMBL432083 {{2-[Carboxymethyl-(2-{carboxymethyl-[(5-sulfamoyl-[1,3,4]thiadiazol-2-ylcarbamoyl)-methyl]-amino}-ethyl)-amino]-ethyl}-[(5-sulfamoyl-[1,3,4]thiadiazol-2-ylcarbamoyl)-methyl]-amino}-acetic acid {{2-[Carboxymethyl-(2-{carboxymethyl-[(5-sulfamoyl-[1,3,4]thiadiazol-2-ylcarbamoyl)-methyl]-amino}-ethyl)-amino]-ethyl}-[(5-sulfamoyl-[1,3,4]thiadiazol-2-ylcarbamoyl)-methyl]-amino}-acetic acid;compound with Al complex | {{2-[Carboxymethyl-(2-{carboxymethyl-[(5-sulfamoyl-[1,3,4]thiadiazol-2-ylcarbamoyl)-methyl]-amino}-ethyl)-amino]-ethyl}-[(5-sulfamoyl-[1,3,4]thiadiazol-2-ylcarbamoyl)-methyl]-amino}-acetic acid;compound with Zn complex
TypeSmall organic molecule
Emp. Form.C18H27N11O12S4
Mol. Mass.717.733
SMILESNS(=O)(=O)c1nnc(NC(=O)CN(CCN(CCN(CC(O)=O)CC(=O)Nc2nnc(s2)S(N)(=O)=O)CC(O)=O)CC(O)=O)s1