Reaction Details
TargetCarbonic anhydrase 12
LigandBDBM10857
Substrate/Competitorn/a
Meas. Tech.ChEMBL_469185 (CHEMBL932210)
Ki 37±n/a nM
Citation Rami, MWinum, JYInnocenti, AMontero, JLScozzafava, ASupuran, CT Carbonic anhydrase inhibitors: copper(II) complexes of polyamino-polycarboxylamido aromatic/heterocyclic sulfonamides are very potent inhibitors of the tumor-associated isoforms IX and XII. Bioorg Med Chem Lett18:836-41 (2008) 
 
Carbonic anhydrase 12
Name:Carbonic anhydrase 12
Type:Enzyme
Mol. Mass.:39456.00
Organism:Homo sapiens (Human)
Description:Catalytic domain of human cloned isozyme was used in the assay
Residue:354
BDBM10857
NameBDBM10857
Synonyms:4-aminobenzene-1-sulfonamide Sulfanilamide aromatic/heteroaromatic sulfonamide 2 | halogenosulfanilamide deriv. 5a
TypeSmall organic molecule
Emp. Form.C6H8N2O2S
Mol. Mass.172.205
SMILESNc1ccc(cc1)S(N)(=O)=O