Reaction Details
TargetCarbonic anhydrase 12
LigandBDBM50097276
Substrate/Competitorn/a
Meas. Tech.ChEMBL_469185 (CHEMBL932210)
Ki 4±n/a nM
Citation Rami, MWinum, JYInnocenti, AMontero, JLScozzafava, ASupuran, CT Carbonic anhydrase inhibitors: copper(II) complexes of polyamino-polycarboxylamido aromatic/heterocyclic sulfonamides are very potent inhibitors of the tumor-associated isoforms IX and XII. Bioorg Med Chem Lett18:836-41 (2008) 
 
Carbonic anhydrase 12
Name:Carbonic anhydrase 12
Type:Enzyme
Mol. Mass.:39456.00
Organism:Homo sapiens (Human)
Description:Catalytic domain of human cloned isozyme was used in the assay
Residue:354
BDBM50097276
NameBDBM50097276
Synonyms:CHEMBL286449 {{2-[Carboxymethyl-(2-{carboxymethyl-[(4-sulfamoyl-benzylcarbamoyl)-methyl]-amino}-ethyl)-amino]-ethyl}-[(4-sulfamoyl-benzylcarbamoyl)-methyl]-amino}-acetic acid; compound with Zn complex | {{2-[carboxymethyl-(2-{carboxymethyl-[(4-sulfamoyl-benzylcarbamoyl)-methyl]-amino}-ethyl)-amino]-ethyl}-[(4-sulfamoyl-benzylcarbamoyl)-methyl]-amino}-acetic acid
TypeSmall organic molecule
Emp. Form.C28H39N7O12S2
Mol. Mass.729.779
SMILESNS(=O)(=O)c1ccc(CNC(=O)CN(CCN(CCN(CC(O)=O)CC(=O)NCc2ccc(cc2)S(N)(=O)=O)CC(O)=O)CC(O)=O)cc1