Reaction Details
TargetCoagulation factor X
LigandBDBM50374269
Substrate/Competitorn/a
Meas. Tech.ChEMBL_469192 (CHEMBL932218)
Ki 29.3±n/a nM
Citation Young, RJBorthwick, ADBrown, DBurns-Kurtis, CLCampbell, MChan, CCharbaut, MConvery, MADiallo, HHortense, EIrving, WRKelly, HAKing, NPKleanthous, SMason, AMPateman, AJPatikis, ANPinto, ILPollard, DRSenger, SShah, GPToomey, JRWatson, NSWeston, HEZhou, P Structure and property based design of factor Xa inhibitors: biaryl pyrrolidin-2-ones incorporating basic heterocyclic motifs. Bioorg Med Chem Lett18:28-33 (2008) 
 
Coagulation factor X
Name:Coagulation factor X
Type:Enzyme
Mol. Mass.:54726.60
Organism:Homo sapiens (Human)
Description:n/a
Residue:488
BDBM50374269
NameBDBM50374269
Synonyms:CHEMBL271088
TypeSmall organic molecule
Emp. Form.C23H25ClFN5O3S2
Mol. Mass.538.058
SMILESCN(C)Cc1cn(cn1)-c1ccc(N2CCC(NS(=O)(=O)\C=C(/C)c3ccc(Cl)s3)C2=O)c(F)c1