Reaction Details
TargetCoagulation factor X
LigandBDBM50374272
Substrate/Competitorn/a
Meas. Tech.ChEMBL_469192 (CHEMBL932218)
Ki 5.9±n/a nM
Citation Young, RJBorthwick, ADBrown, DBurns-Kurtis, CLCampbell, MChan, CCharbaut, MConvery, MADiallo, HHortense, EIrving, WRKelly, HAKing, NPKleanthous, SMason, AMPateman, AJPatikis, ANPinto, ILPollard, DRSenger, SShah, GPToomey, JRWatson, NSWeston, HEZhou, P Structure and property based design of factor Xa inhibitors: biaryl pyrrolidin-2-ones incorporating basic heterocyclic motifs. Bioorg Med Chem Lett18:28-33 (2008) 
 
Coagulation factor X
Name:Coagulation factor X
Type:Enzyme
Mol. Mass.:54726.60
Organism:Homo sapiens (Human)
Description:n/a
Residue:488
BDBM50374272
NameBDBM50374272
Synonyms:CHEMBL270592
TypeSmall organic molecule
Emp. Form.C24H24ClFN6O3S
Mol. Mass.531.002
SMILESCN(C)Cc1nccn1-c1ccc(N2CCC(NS(=O)(=O)c3ccc4[nH]cc(Cl)c4c3)C2=O)c(F)c1