Reaction Details
TargetCoagulation factor X
LigandBDBM50228676
Substrate/Competitorn/a
Meas. Tech.ChEMBL_469192 (CHEMBL932218)
Ki 0.2±n/a nM
Citation Young, RJBorthwick, ADBrown, DBurns-Kurtis, CLCampbell, MChan, CCharbaut, MConvery, MADiallo, HHortense, EIrving, WRKelly, HAKing, NPKleanthous, SMason, AMPateman, AJPatikis, ANPinto, ILPollard, DRSenger, SShah, GPToomey, JRWatson, NSWeston, HEZhou, P Structure and property based design of factor Xa inhibitors: biaryl pyrrolidin-2-ones incorporating basic heterocyclic motifs. Bioorg Med Chem Lett18:28-33 (2008) 
 
Coagulation factor X
Name:Coagulation factor X
Type:Enzyme
Mol. Mass.:54726.60
Organism:Homo sapiens (Human)
Description:n/a
Residue:488
BDBM50228676
NameBDBM50228676
Synonyms:(S)-2-(5-chlorothiophen-2-yl)-N-(1-(4-(2-((dimethylamino)methyl)-1H-imidazol-1-yl)-2-fluorophenyl)-2-oxopyrrolidin-3-yl)ethenesulfonamide CHEMBL402109
TypeSmall organic molecule
Emp. Form.C22H23ClFN5O3S2
Mol. Mass.524.031
SMILESCN(C)Cc1nccn1-c1ccc(N2CC[C@H](NS(=O)(=O)\C=C\c3ccc(Cl)s3)C2=O)c(F)c1