Reaction Details
TargetP2Y purinoceptor 12
LigandBDBM50374572
Substrate/Competitorn/a
Meas. Tech.ChEMBL_469575 (CHEMBL933022)
IC50 201±n/a nM
Citation Douglass, JGdeCamp, JBFulcher, EHJones, WMahanty, SMorgan, ASmirnov, DBoyer, JLWatson, PS Adenosine analogues as inhibitors of P2Y12 receptor mediated platelet aggregation. Bioorg Med Chem Lett18:2167-71 (2008) 
 
P2Y purinoceptor 12
Name:P2Y purinoceptor 12
Type:Enzyme
Mol. Mass.:39458.48
Organism:Homo sapiens (Human)
Description:Q9H244
Residue:342
BDBM50374572
NameBDBM50374572
Synonyms:CHEMBL403010
TypeSmall organic molecule
Emp. Form.C22H22N6O6
Mol. Mass.466.4467
SMILESCCNC(=O)Nc1ncnc2n(cnc12)[C@@H]1O[C@@H]([C@H]2O[C@@H](O[C@@H]12)\C=C\c1ccccc1)C(O)=O