Reaction Details
TargetVitamin D3 receptor
LigandBDBM50329706
Substrate/Competitorn/a
Meas. Tech.ChEMBL_469766 (CHEMBL948042)
EC50 0.0396±n/a nM
Citation Hakamata, WSato, YOkuda, HHonzawa, SSaito, NKishimoto, SYamashita, ASugiura, TKittaka, AKurihara, M (2S,2'R)-analogue of LG190178 is a major active isomer. Bioorg Med Chem Lett18:120-3 (2008) 
 
Vitamin D3 receptor
Name:Vitamin D3 receptor
Type:Protein
Mol. Mass.:48288.72
Organism:Homo sapiens (Human)
Description:P11473
Residue:427
BDBM50329706
NameBDBM50329706
Synonyms:(2S)-3-{4-[1-ethyl-1-(4-{[(2R)-2-hydroxy-3,3-dimethylbutyl]oxy}-3-methylphenyl)propyl]-2-methylphenoxy}propane-1,2-diol CHEMBL272304
TypeSmall organic molecule
Emp. Form.C28H42O5
Mol. Mass.458.6301
SMILESCCC(CC)(c1ccc(OC[C@@H](O)CO)c(C)c1)c1ccc(OC[C@H](O)C(C)(C)C)c(C)c1