Reaction Details
TargetLanosterol 14-alpha demethylase
LigandBDBM50375215
Substrate/Competitorn/a
Meas. Tech.ChEMBL_470401 (CHEMBL939288)
Kd>1000000±n/a nM
Citation Korosec, TAcimovic, JSeliskar, MKocjan, DTacer, KFRozman, DUrleb, U Novel cholesterol biosynthesis inhibitors targeting human lanosterol 14alpha-demethylase (CYP51). Bioorg Med Chem16:209-21 (2008) 
 
Lanosterol 14-alpha demethylase
Name:Lanosterol 14-alpha demethylase
Type:Protein
Mol. Mass.:56817.21
Organism:Homo sapiens (Human)
Description:Q16850
Residue:509
BDBM50375215
NameBDBM50375215
Synonyms:CHEMBL538591
TypeSmall organic molecule
Emp. Form.C19H24Cl2N2O
Mol. Mass.367.313
SMILESCCCN(CCc1ccc(Cl)c(Cl)c1)CC(O)c1cc(C)ccn1