Reaction Details
TargetMu-type opioid receptor
LigandBDBM50375376
Substrate/Competitorn/a
Meas. Tech.ChEMBL_471597 (CHEMBL940228)
Ki 6800±n/a nM
Citation Jung, BEnglberger, WFröhlich, RSchepmann, DLehmkuhl, KWünsch, B Synthesis and pharmacological evaluation of bicyclic SNC80 analogues with separated benzhydryl moiety. Bioorg Med Chem16:2870-85 (2008) 
 
Mu-type opioid receptor
Name:Mu-type opioid receptor
Type:G Protein-Coupled Receptor (GPCR)
Mol. Mass.:44789.51
Organism:Homo sapiens (Human)
Description:P35372
Residue:400
BDBM50375376
NameBDBM50375376
Synonyms:CHEMBL260521
TypeSmall organic molecule
Emp. Form.C28H35N3O
Mol. Mass.429.597
SMILESCCN(CC)C(=O)c1ccc(CN2C[C@@H]3CC=C([C@H]2CN3CC=C)c2ccccc2)cc1