Reaction Details
Target5-hydroxytryptamine receptor 2C
LigandBDBM50375448
Substrate/Competitorn/a
Meas. Tech.ChEMBL_472646 (CHEMBL921962)
Ki 5±n/a nM
Citation Shimada, IMaeno, KKazuta, KKubota, HKimizuka, TKimura, YHatanaka, KNaitou, YWanibuchi, FSakamoto, STsukamoto, S Synthesis and structure-activity relationships of a series of substituted 2-(1H-furo[2,3-g]indazol-1-yl)ethylamine derivatives as 5-HT2C receptor agonists. Bioorg Med Chem16:1966-82 (2008) 
 
5-hydroxytryptamine receptor 2C
Name:5-hydroxytryptamine receptor 2C
Type:G Protein-Coupled Receptor (GPCR)
Mol. Mass.:51836.79
Organism:Homo sapiens (Human)
Description:P28335
Residue:458
BDBM50375448
NameBDBM50375448
Synonyms:CHEMBL403926
TypeSmall organic molecule
Emp. Form.C15H19N3O
Mol. Mass.257.3309
SMILESCCc1cc2c(ccc3c(C)nn(C[C@H](C)N)c23)o1