Reaction Details
TargetVascular endothelial growth factor receptor 2
LigandBDBM50221566
Substrate/Competitorn/a
Meas. Tech.ChEMBL_473235 (CHEMBL932926)
IC50 2.2±n/a nM
Citation Palanki, MSAkiyama, HCampochiaro, PCao, JChow, CPDellamary, LDoukas, JFine, RGritzen, CHood, JDHu, SKachi, SKang, XKlebansky, BKousba, ALohse, DMak, CCMartin, MMcPherson, APathak, VPRenick, JSoll, RUmeda, NYee, SYokoi, KZeng, BZhu, HNoronha, G Development of prodrug 4-chloro-3-(5-methyl-3-{[4-(2-pyrrolidin-1-ylethoxy)phenyl]amino}-1,2,4-benzotriazin-7-yl)phenyl benzoate (TG100801): a topically administered therapeutic candidate in clinical trials for the treatment of age-related macular degeneration. J Med Chem51:1546-59 (2008) 
 
Vascular endothelial growth factor receptor 2
Name:Vascular endothelial growth factor receptor 2
Type:Receptor Tyrosine Kinase
Mol. Mass.:151510.97
Organism:Homo sapiens (Human)
Description:P35968
Residue:1356
BDBM50221566
NameBDBM50221566
Synonyms:4-chloro-3-(5-methyl-3-(4-(2-(pyrrolidin-1-yl)ethoxy)phenylamino)benzo[e][1,2,4]triazin-7-yl)phenol CHEMBL400402 US8481536, 597
TypeSmall organic molecule
Emp. Form.C26H26ClN5O2
Mol. Mass.475.97
SMILESCc1cc(cc2nnc(Nc3ccc(OCCN4CCCC4)cc3)nc12)-c1cc(O)ccc1Cl