Reaction Details
TargetATP-dependent translocase ABCB1
LigandBDBM50411958
Substrate/Competitorn/a
Meas. Tech.ChEMBL_474393 (CHEMBL939120)
IC50 416.87±n/a nM
Citation Müller, HPajeva, IKGlobisch, CWiese, M Functional assay and structure-activity relationships of new third-generation P-glycoprotein inhibitors. Bioorg Med Chem16:2448-62 (2008) 
 
ATP-dependent translocase ABCB1
Name:ATP-dependent translocase ABCB1
Type:Protein
Mol. Mass.:141503.50
Organism:Homo sapiens (Human)
Description:P08183
Residue:1280
BDBM50411958
NameBDBM50411958
Synonyms:CHEMBL411951
TypeSmall organic molecule
Emp. Form.C27H25N3O
Mol. Mass.407.5069
SMILESO=C(Nc1ccc(CCN2CCc3ccccc3C2)cc1)c1cnc2ccccc2c1