Reaction Details
TargetATP-dependent translocase ABCB1
LigandBDBM50305080
Substrate/Competitorn/a
Meas. Tech.ChEMBL_474393 (CHEMBL939120)
IC50 331.13±n/a nM
Citation Müller, HPajeva, IKGlobisch, CWiese, M Functional assay and structure-activity relationships of new third-generation P-glycoprotein inhibitors. Bioorg Med Chem16:2448-62 (2008) 
 
ATP-dependent translocase ABCB1
Name:ATP-dependent translocase ABCB1
Type:Protein
Mol. Mass.:141503.50
Organism:Homo sapiens (Human)
Description:P08183
Residue:1280
BDBM50305080
NameBDBM50305080
Synonyms:CHEMBL247473 N-(2-{4-[2-(6,7-Dimethoxy-3,4-dihydro-1H-isoquinolin-2-yl)-ethyl]-phenylcarbamoyl}-phenyl)-3,4-dimethoxy-benzamide
TypeSmall organic molecule
Emp. Form.C35H37N3O6
Mol. Mass.595.6848
SMILESCOc1ccc(cc1OC)C(=O)Nc1ccccc1C(=O)Nc1ccc(CCN2CCc3cc(OC)c(OC)cc3C2)cc1