Reaction Details
Target5-hydroxytryptamine receptor 2C
LigandBDBM50375899
Substrate/Competitorn/a
Meas. Tech.ChEMBL_474628 (CHEMBL936729)
Ki 5.1±n/a nM
Citation Shimada, IMaeno, KKondoh, YKaku, HSugasawa, KKimura, YHatanaka, KNaitou, YWanibuchi, FSakamoto, STsukamoto, S Synthesis and structure-activity relationships of a series of benzazepine derivatives as 5-HT2C receptor agonists. Bioorg Med Chem16:3309-20 (2008) 
 
5-hydroxytryptamine receptor 2C
Name:5-hydroxytryptamine receptor 2C
Type:G Protein-Coupled Receptor (GPCR)
Mol. Mass.:51836.79
Organism:Homo sapiens (Human)
Description:P28335
Residue:458
BDBM50375899
NameBDBM50375899
Synonyms:CHEMBL406585
TypeSmall organic molecule
Emp. Form.C11H11ClN2
Mol. Mass.206.671
SMILESClc1c2CCNCCc2ccc1C#N