Reaction Details
TargetMitogen-activated protein kinase 8
LigandBDBM50376115
Substrate/Competitorn/a
Meas. Tech.ChEMBL_475207 (CHEMBL921935)
IC50 7.3±n/a nM
Citation Asano, YKitamura, SOhra, TItoh, FKajino, MTamura, TKaneko, MIkeda, SIgata, HKawamoto, TSogabe, SMatsumoto, STanaka, TYamaguchi, MKimura, HFukumoto, S Discovery, synthesis and biological evaluation of isoquinolones as novel and highly selective JNK inhibitors (2). Bioorg Med Chem16:4699-714 (2008) 
 
Mitogen-activated protein kinase 8
Name:Mitogen-activated protein kinase 8
Type:Enzyme
Mol. Mass.:48297.57
Organism:Homo sapiens (Human)
Description:JNK-1 was purchased from Upstate Cell Signaling Solutions (formerly Upstate Biotechnology).
Residue:427
BDBM50376115
NameBDBM50376115
Synonyms:CHEMBL437107
TypeSmall organic molecule
Emp. Form.C24H21ClN4O3
Mol. Mass.448.902
SMILESCCC(=O)c1c(-c2ccccc2)c2cc(Cl)ccc2c(=O)n1Cc1cc(C(N)=O)n(C)n1