Reaction Details
TargetRmtA
LigandBDBM50376131
Substrate/Competitorn/a
Meas. Tech.ChEMBL_475539 (CHEMBL925748)
IC50 29000±n/a nM
Citation Mai, ACheng, DBedford, MTValente, SNebbioso, APerrone, ABrosch, GSbardella, GDe Bellis, FMiceli, MAltucci, L epigenetic multiple ligands: mixed histone/protein methyltransferase, acetyltransferase, and class III deacetylase (sirtuin) inhibitors. J Med Chem51:2279-90 (2008) 
 
RmtA
Name:RmtA
Synonyms:n/a
Type:PROTEIN
Mol. Mass.:39351.26
Organism:Emericella nidulans
Description:ChEMBL_475539
Residue:345
BDBM50376131
NameBDBM50376131
Synonyms:CHEMBL430233
TypeSmall organic molecule
Emp. Form.C15H8Br4O3
Mol. Mass.555.838
SMILESOc1c(Br)cc(\C=C\C(=O)c2cc(Br)c(O)c(Br)c2)cc1Br