Reaction Details
TargetRmtA
LigandBDBM50376135
Substrate/Competitorn/a
Meas. Tech.ChEMBL_475539 (CHEMBL925748)
IC50 69000±n/a nM
Citation Mai, ACheng, DBedford, MTValente, SNebbioso, APerrone, ABrosch, GSbardella, GDe Bellis, FMiceli, MAltucci, L epigenetic multiple ligands: mixed histone/protein methyltransferase, acetyltransferase, and class III deacetylase (sirtuin) inhibitors. J Med Chem51:2279-90 (2008) 
 
RmtA
Name:RmtA
Synonyms:n/a
Type:PROTEIN
Mol. Mass.:39351.26
Organism:Emericella nidulans
Description:ChEMBL_475539
Residue:345
BDBM50376135
NameBDBM50376135
Synonyms:CHEMBL259008
TypeSmall organic molecule
Emp. Form.C17H10Br4O3
Mol. Mass.581.876
SMILESOc1c(Br)cc(\C=C\C(=O)\C=C\c2cc(Br)c(O)c(Br)c2)cc1Br