Reaction Details
TargetRmtA
LigandBDBM50376137
Substrate/Competitorn/a
Meas. Tech.ChEMBL_475539 (CHEMBL925748)
IC50 32600±n/a nM
Citation Mai, ACheng, DBedford, MTValente, SNebbioso, APerrone, ABrosch, GSbardella, GDe Bellis, FMiceli, MAltucci, L epigenetic multiple ligands: mixed histone/protein methyltransferase, acetyltransferase, and class III deacetylase (sirtuin) inhibitors. J Med Chem51:2279-90 (2008) 
 
RmtA
Name:RmtA
Synonyms:n/a
Type:PROTEIN
Mol. Mass.:39351.26
Organism:Emericella nidulans
Description:ChEMBL_475539
Residue:345
BDBM50376137
NameBDBM50376137
Synonyms:CHEMBL260211
TypeSmall organic molecule
Emp. Form.C14H8Br4N2O4
Mol. Mass.587.84
SMILESOc1c(Br)cc(NC(=O)C(=O)Nc2cc(Br)c(O)c(Br)c2)cc1Br