Reaction Details
TargetRmtA
LigandBDBM50376146
Substrate/Competitorn/a
Meas. Tech.ChEMBL_475539 (CHEMBL925748)
IC50 59000±n/a nM
Citation Mai, ACheng, DBedford, MTValente, SNebbioso, APerrone, ABrosch, GSbardella, GDe Bellis, FMiceli, MAltucci, L epigenetic multiple ligands: mixed histone/protein methyltransferase, acetyltransferase, and class III deacetylase (sirtuin) inhibitors. J Med Chem51:2279-90 (2008) 
 
RmtA
Name:RmtA
Synonyms:n/a
Type:PROTEIN
Mol. Mass.:39351.26
Organism:Emericella nidulans
Description:ChEMBL_475539
Residue:345
BDBM50376146
NameBDBM50376146
Synonyms:CHEMBL258902
TypeSmall organic molecule
Emp. Form.C24H16Br2O4
Mol. Mass.528.189
SMILESOc1ccc(\C=C\C(=O)c2cccc(c2)C(=O)\C=C\c2ccc(O)c(Br)c2)cc1Br