Reaction Details
TargetRmtA
LigandBDBM50376150
Substrate/Competitorn/a
Meas. Tech.ChEMBL_475539 (CHEMBL925748)
IC50 132000±n/a nM
Citation Mai, ACheng, DBedford, MTValente, SNebbioso, APerrone, ABrosch, GSbardella, GDe Bellis, FMiceli, MAltucci, L epigenetic multiple ligands: mixed histone/protein methyltransferase, acetyltransferase, and class III deacetylase (sirtuin) inhibitors. J Med Chem51:2279-90 (2008) 
 
RmtA
Name:RmtA
Synonyms:n/a
Type:PROTEIN
Mol. Mass.:39351.26
Organism:Emericella nidulans
Description:ChEMBL_475539
Residue:345
BDBM50376150
NameBDBM50376150
Synonyms:CHEMBL407234
TypeSmall organic molecule
Emp. Form.C19H14Br2O4
Mol. Mass.466.12
SMILESOc1ccc(\C=C2/COC\C(=C/c3ccc(O)c(Br)c3)C2=O)cc1Br