Reaction Details
TargetRmtA
LigandBDBM50376153
Substrate/Competitorn/a
Meas. Tech.ChEMBL_475539 (CHEMBL925748)
IC50 161600±n/a nM
Citation Mai, ACheng, DBedford, MTValente, SNebbioso, APerrone, ABrosch, GSbardella, GDe Bellis, FMiceli, MAltucci, L epigenetic multiple ligands: mixed histone/protein methyltransferase, acetyltransferase, and class III deacetylase (sirtuin) inhibitors. J Med Chem51:2279-90 (2008) 
 
RmtA
Name:RmtA
Synonyms:n/a
Type:PROTEIN
Mol. Mass.:39351.26
Organism:Emericella nidulans
Description:ChEMBL_475539
Residue:345
BDBM50376153
NameBDBM50376153
Synonyms:CHEMBL259459
TypeSmall organic molecule
Emp. Form.C20H17Br2NO3
Mol. Mass.479.162
SMILESCN1C\C(=C/c2ccc(O)c(Br)c2)C(=O)\C(C1)=C\c1ccc(O)c(Br)c1