Reaction Details
TargetThromboxane A2 receptor
LigandBDBM50376304
Substrate/Competitorn/a
Meas. Tech.ChEMBL_475967 (CHEMBL935622)
Ki 11.7±n/a nM
Citation Beaulieu, CGuay, DWang, ZLeblanc, YRoy, PDufresne, CZamboni, RBerthelette, CDay, STsou, NDenis, DGreig, GMathieu, MCO'Neill, G Identification of prostaglandin D2 receptor antagonists based on a tetrahydropyridoindole scaffold. Bioorg Med Chem Lett18:2696-700 (2008) 
 
Thromboxane A2 receptor
Name:Thromboxane A2 receptor
Type:Enyzme
Mol. Mass.:37445.28
Organism:Homo sapiens (Human)
Description:P21731
Residue:343
BDBM50376304
NameBDBM50376304
Synonyms:CHEMBL261501
TypeSmall organic molecule
Emp. Form.C21H19ClFNO4S
Mol. Mass.435.896
SMILESCS(=O)(=O)c1cc(F)cc2n3CCC(CC(O)=O)c3c(Cc3ccc(Cl)cc3)c12