Reaction Details
TargetCoagulation factor V
LigandBDBM50423622
Substrate/Competitorn/a
Meas. Tech.ChEMBL_476654 (CHEMBL927167)
IC50 15710±n/a nM
Citation Segers, KSperandio, OSack, MFischer, RMiteva, MARosing, JNicolaes, GAVilloutreix, BO Design of protein membrane interaction inhibitors by virtual ligand screening, proof of concept with the C2 domain of factor V. Proc Natl Acad Sci U S A104:12697-702 (2007) 
 
Coagulation factor V
Name:Coagulation factor V
Type:PROTEIN
Mol. Mass.:251677.76
Organism:Homo sapiens (Human)
Description:ChEMBL_476655
Residue:2224
BDBM50423622
NameBDBM50423622
Synonyms:CHEMBL1614804
TypeSmall organic molecule
Emp. Form.C23H28Cl2N4O2
Mol. Mass.463.4
SMILESO[C@@H](COc1ccc(Cl)cc1Cl)Cn1c2ccccc2n(CCN2CCCCC2)c1=N