Reaction Details
TargetMetabotropic glutamate receptor 3
LigandBDBM50376468
Substrate/Competitorn/a
Meas. Tech.ChEMBL_476983 (CHEMBL937488)
IC50 17±n/a nM
Citation Woltering, TJWichmann, JGoetschi, EAdam, GKew, JNKnoflach, FBallard, TMHuwyler, JMutel, VGatti, S Synthesis and characterization of 1,3-dihydro-benzo[b][1,4]diazepin-2-one derivatives: Part 3. New potent non-competitive metabotropic glutamate receptor 2/3 antagonists. Bioorg Med Chem Lett18:2725-9 (2008) 
 
Metabotropic glutamate receptor 3
Name:Metabotropic glutamate receptor 3
Type:Protein
Mol. Mass.:98971.84
Organism:Rattus norvegicus (Rat)
Description:P31422
Residue:879
BDBM50376468
NameBDBM50376468
Synonyms:CHEMBL259054
TypeSmall organic molecule
Emp. Form.C24H17FN4O
Mol. Mass.396.4164
SMILESFc1ccc(cc1)-c1ccc2N=C(CC(=O)Nc2c1)c1cccc(c1)-n1ccnc1