Reaction Details
TargetMetabotropic glutamate receptor 2
LigandBDBM50332991
Substrate/Competitorn/a
Meas. Tech.ChEMBL_476982 (CHEMBL937487)
IC50 22±n/a nM
Citation Woltering, TJWichmann, JGoetschi, EAdam, GKew, JNKnoflach, FBallard, TMHuwyler, JMutel, VGatti, S Synthesis and characterization of 1,3-dihydro-benzo[b][1,4]diazepin-2-one derivatives: Part 3. New potent non-competitive metabotropic glutamate receptor 2/3 antagonists. Bioorg Med Chem Lett18:2725-9 (2008) 
 
Metabotropic glutamate receptor 2
Name:Metabotropic glutamate receptor 2
Type:Enzyme
Mol. Mass.:95584.88
Organism:Homo sapiens (Human)
Description:Q14416
Residue:872
BDBM50332991
NameBDBM50332991
Synonyms:4-(3-(1H-1,2,3-triazol-1-yl)phenyl)-8-(2-fluorophenyl)-1H-benzo[b][1,4]diazepin-2(3H)-one | CHEMBL261288
TypeSmall organic molecule
Emp. Form.C23H16FN5O
Mol. Mass.397.4044
SMILESFc1ccccc1-c1ccc2N=C(CC(=O)Nc2c1)c1cccc(c1)-n1ccnn1