Reaction Details
TargetEphrin type-B receptor 4
LigandBDBM50376901
Substrate/Competitorn/a
Meas. Tech.ChEMBL_478601 (CHEMBL922442)
Ki 7.27±n/a nM
Citation Hu, SXSoll, RYee, SLohse, DLKousba, AZeng, BYu, XMcPherson, ARenick, JCao, JTabak, AHood, JDoukas, JNoronha, GMartin, M Metabolism and pharmacokinetics of a novel Src kinase inhibitor TG100435 ([7-(2,6-dichloro-phenyl)-5-methyl-benzo[1,2,4]triazin-3-yl]-[4-(2-pyrrolidin-1-yl-ethoxy)-phenyl]-amine) and its active N-oxide metabolite TG100855 ([7-(2,6-dichloro-phenyl)-5-methylbenzo[1,2,4]triazin-3-yl]-{4-[2-(1-oxy-pyrr Drug Metab Dispos35:929-36 (2007) 
 
Ephrin type-B receptor 4
Name:Ephrin type-B receptor 4
Type:Enzyme
Mol. Mass.:108273.51
Organism:Homo sapiens (Human)
Description:P54760
Residue:987
BDBM50376901
NameBDBM50376901
Synonyms:CHEMBL256101 | TG-100855
TypeSmall organic molecule
Emp. Form.C26H25Cl2N5O2
Mol. Mass.510.415
SMILESCc1cc(cc2nnc(Nc3ccc(OCC[N+]4([O-])CCCC4)cc3)nc12)-c1c(Cl)cccc1Cl