Reaction Details
Target5-hydroxytryptamine receptor 3A
LigandBDBM36022
Substrate/Competitorn/a
Meas. Tech.ChEMBL_478755 (CHEMBL923632)
EC50 24±n/a nM
Citation Petrascheck, MYe, XBuck, LB An antidepressant that extends lifespan in adult Caenorhabditis elegans. Nature450:553-556 (2007) 
 
5-hydroxytryptamine receptor 3A
Name:5-hydroxytryptamine receptor 3A
Type:Protein
Mol. Mass.:55283.27
Organism:Homo sapiens (Human)
Description:P46098
Residue:478
BDBM36022
NameBDBM36022
Synonyms:(+/-)-octopamine | Octopamine,(+/-)
TypeGuest
Emp. Form.C8H12NO2
Mol. Mass.154.1858
SMILES[NH3+]CC(O)c1ccc(O)cc1