Reaction Details
TargetHydroxycarboxylic acid receptor 2
LigandBDBM23515
Substrate/Competitorn/a
Meas. Tech.ChEMBL_479059 (CHEMBL921666)
EC50 580±n/a nM
Citation Richman, JGKanemitsu-Parks, MGaidarov, ICameron, JSGriffin, PZheng, HGuerra, NCCham, LMaciejewski-Lenoir, DBehan, DPBoatman, DChen, RSkinner, POrnelas, PWaters, MGWright, SDSemple, GConnolly, DT Nicotinic acid receptor agonists differentially activate downstream effectors. J Biol Chem282:18028-36 (2007) 
 
Hydroxycarboxylic acid receptor 2
Name:Hydroxycarboxylic acid receptor 2
Type:G Protein-Coupled Receptor (GPCR)
Mol. Mass.:41868.22
Organism:Homo sapiens (Human)
Description:Membranes from CHO cells expressing the recombinant human GPR109A were used in competition binding assay.
Residue:363
BDBM23515
NameBDBM23515
Synonyms:CHEMBL573 Nicotinic Acid pyridine-3-carboxylic acid | wampocap
TypeSmall organic molecule
Emp. Form.C6H5NO2
Mol. Mass.123.1094
SMILESOC(=O)c1cccnc1