Reaction Details
TargetNAD-dependent protein deacetylase sirtuin-1
LigandBDBM23926
Substrate/Competitorn/a
Meas. Tech.ChEMBL_479066 (CHEMBL933817)
EC50 46200±n/a nM
Citation Milne, JCLambert, PDSchenk, SCarney, DPSmith, JJGagne, DJJin, LBoss, OPerni, RBVu, CBBemis, JEXie, RDisch, JSNg, PYNunes, JJLynch, AVYang, HGalonek, HIsraelian, KChoy, WIffland, ALavu, SMedvedik, OSinclair, DAOlefsky, JMJirousek, MRElliott, PJWestphal, CH Small molecule activators of SIRT1 as therapeutics for the treatment of type 2 diabetes. Nature450:712-716 (2007) 
 
NAD-dependent protein deacetylase sirtuin-1
Name:NAD-dependent protein deacetylase sirtuin-1
Type:Developmental protein; hydrolase
Mol. Mass.:81626.66
Organism:Homo sapiens (Human)
Description:n/a
Residue:747
BDBM23926
NameBDBM23926
Synonyms:(E)-resveratrol CHEMBL165 Stilbene, 2f cid_445154 trans-resveratrol
TypeSmall organic molecule
Emp. Form.C14H12O3
Mol. Mass.228.2433
SMILESOc1ccc(\C=C\c2cc(O)cc(O)c2)cc1