Reaction Details
TargetNAD-dependent protein deacetylase sirtuin-2
LigandBDBM50228363
Substrate/Competitorn/a
Meas. Tech.ChEMBL_479067 (CHEMBL933818)
EC50 37000±n/a nM
Citation Milne, JCLambert, PDSchenk, SCarney, DPSmith, JJGagne, DJJin, LBoss, OPerni, RBVu, CBBemis, JEXie, RDisch, JSNg, PYNunes, JJLynch, AVYang, HGalonek, HIsraelian, KChoy, WIffland, ALavu, SMedvedik, OSinclair, DAOlefsky, JMJirousek, MRElliott, PJWestphal, CH Small molecule activators of SIRT1 as therapeutics for the treatment of type 2 diabetes. Nature450:712-716 (2007) 
 
NAD-dependent protein deacetylase sirtuin-2
Name:NAD-dependent protein deacetylase sirtuin-2
Type:Hydrolase
Mol. Mass.:43172.62
Organism:Homo sapiens (Human)
Description:n/a
Residue:389
BDBM50228363
NameBDBM50228363
Synonyms:CHEMBL257991 SRT-1720
TypeSmall organic molecule
Emp. Form.C25H23N7OS
Mol. Mass.469.561
SMILESO=C(Nc1ccccc1-c1cn2c(CN3CCNCC3)csc2n1)c1cnc2ccccc2n1