Reaction Details
TargetEnoyl-[acyl-carrier-protein] reductase [NADH] FabI
LigandBDBM8726
Substrate/Competitorn/a
Meas. Tech.ChEMBL_479301 (CHEMBL933673)
IC50 500±n/a nM
Citation Tipparaju, SKJoyasawal, SForrester, SMulhearn, DCPegan, SJohnson, MEMesecar, ADKozikowski, AP Design and synthesis of 2-pyridones as novel inhibitors of the Bacillus anthracis enoyl-ACP reductase. Bioorg Med Chem Lett18:3565-9 (2008) 
 
Enoyl-[acyl-carrier-protein] reductase [NADH] FabI
Name:Enoyl-[acyl-carrier-protein] reductase [NADH] FabI
Type:PROTEIN
Mol. Mass.:27870.90
Organism:Bacillus subtilis (strain 168)
Description:ChEMBL_479301
Residue:258
BDBM8726
NameBDBM8726
Synonyms:5-chloro-2-(2,4-dichlorophenoxy)phenol TCL US20230414581, Compound 35
TypeSmall organic molecule
Emp. Form.C12H7Cl3O2
Mol. Mass.289.542
SMILESOc1cc(Cl)ccc1Oc1ccc(Cl)cc1Cl