Reaction Details
TargetCytochrome P450 3A4
LigandBDBM50377221
Substrate/Competitorn/a
Meas. Tech.ChEMBL_479364 (CHEMBL921647)
IC50 480±n/a nM
Citation McAtee, JJDodson, JWDowdell, SEGirard, GRGoodman, KBHilfiker, MASehon, CASha, DWang, GZWang, NViet, AQZhang, DAiyar, NVBehm, DJCarballo, LHEvans, CAFries, HENagilla, RRoethke, TJXu, XYuan, CCDouglas, SANeeb, MJ Development of potent and selective small-molecule human Urotensin-II antagonists. Bioorg Med Chem Lett18:3500-3 (2008) 
 
Cytochrome P450 3A4
Name:Cytochrome P450 3A4
Type:Enzyme
Mol. Mass.:57349.57
Organism:Homo sapiens (Human)
Description:n/a
Residue:503
BDBM50377221
NameBDBM50377221
Synonyms:CHEMBL402813
TypeSmall organic molecule
Emp. Form.C27H35Cl2N3O3
Mol. Mass.520.491
SMILESCOCCN(CC(=O)N1CCCC(C1CN1CCOCC1)c1ccccc1)c1ccc(Cl)c(Cl)c1