Reaction Details
TargetCytochrome P450 3A4
LigandBDBM50377225
Substrate/Competitorn/a
Meas. Tech.ChEMBL_479364 (CHEMBL921647)
IC50 770±n/a nM
Citation McAtee, JJDodson, JWDowdell, SEGirard, GRGoodman, KBHilfiker, MASehon, CASha, DWang, GZWang, NViet, AQZhang, DAiyar, NVBehm, DJCarballo, LHEvans, CAFries, HENagilla, RRoethke, TJXu, XYuan, CCDouglas, SANeeb, MJ Development of potent and selective small-molecule human Urotensin-II antagonists. Bioorg Med Chem Lett18:3500-3 (2008) 
 
Cytochrome P450 3A4
Name:Cytochrome P450 3A4
Type:Enzyme
Mol. Mass.:57349.57
Organism:Homo sapiens (Human)
Description:n/a
Residue:503
BDBM50377225
NameBDBM50377225
Synonyms:CHEMBL402805
TypeSmall organic molecule
Emp. Form.C25H31Cl2N3O2
Mol. Mass.476.439
SMILESCN(CC(=O)N1CCCC(C1CN1CCOCC1)c1ccccc1)c1ccc(Cl)c(Cl)c1