Reaction Details
TargetKappa-type opioid receptor
LigandBDBM50377214
Substrate/Competitorn/a
Meas. Tech.ChEMBL_479369 (CHEMBL921652)
EC50 30000±n/a nM
Citation McAtee, JJDodson, JWDowdell, SEGirard, GRGoodman, KBHilfiker, MASehon, CASha, DWang, GZWang, NViet, AQZhang, DAiyar, NVBehm, DJCarballo, LHEvans, CAFries, HENagilla, RRoethke, TJXu, XYuan, CCDouglas, SANeeb, MJ Development of potent and selective small-molecule human Urotensin-II antagonists. Bioorg Med Chem Lett18:3500-3 (2008) 
 
Kappa-type opioid receptor
Name:Kappa-type opioid receptor
Type:G Protein-Coupled Receptor (GPCR)
Mol. Mass.:42648.76
Organism:Homo sapiens (Human)
Description:P41145
Residue:380
BDBM50377214
NameBDBM50377214
Synonyms:CHEMBL256721
TypeSmall organic molecule
Emp. Form.C28H34N4O3
Mol. Mass.474.5946
SMILESCc1cc2ncc(=O)n(CC(=O)N3CCCC(C3CN3CCOCC3)c3ccccc3)c2cc1C