Reaction Details
TargetKappa-type opioid receptor
LigandBDBM50377225
Substrate/Competitorn/a
Meas. Tech.ChEMBL_479369 (CHEMBL921652)
EC50 1000±n/a nM
Citation McAtee, JJDodson, JWDowdell, SEGirard, GRGoodman, KBHilfiker, MASehon, CASha, DWang, GZWang, NViet, AQZhang, DAiyar, NVBehm, DJCarballo, LHEvans, CAFries, HENagilla, RRoethke, TJXu, XYuan, CCDouglas, SANeeb, MJ Development of potent and selective small-molecule human Urotensin-II antagonists. Bioorg Med Chem Lett18:3500-3 (2008) 
 
Kappa-type opioid receptor
Name:Kappa-type opioid receptor
Type:G Protein-Coupled Receptor (GPCR)
Mol. Mass.:42648.76
Organism:Homo sapiens (Human)
Description:P41145
Residue:380
BDBM50377225
NameBDBM50377225
Synonyms:CHEMBL402805
TypeSmall organic molecule
Emp. Form.C25H31Cl2N3O2
Mol. Mass.476.439
SMILESCN(CC(=O)N1CCCC(C1CN1CCOCC1)c1ccccc1)c1ccc(Cl)c(Cl)c1